ISS vocabulary
type: Ontology
license: https://creativecommons.org/licenses/by/4.0/
contributor: Emmanuel Ruffin
contributor: Marina Aguado
created: 2023-09-20
creator: Edna Ruckhaus
creator: Oscar Corcho
publisher: European Railway Agency (ERA)
comment: This is the human and machine readable Vocabulary/Ontology governed by the European Union Agency for Railways (https://www.era.europa.eu/). It represents the concepts and relationships linked to the Information Sharing System (ISS) in accordance with the draft delegated act of the future CSM ASLP Regulation (hereinafter the ‘CSM’ or ‘CSM ASLP).
version info: v1.0.0

In SKOS Concept Scheme
type: AnnotationProperty
created: 2022-11-17
comment: Property that links an object SKOS property to a the URI of the corresponding SKOS Concept Scheme.
term status: stable

altitude
type: AnnotationProperty
comment: The WGS84 altitude of a SpatialThing (decimal meters above the local reference ellipsoid).
domain: SpatialThing

latitude
type: AnnotationProperty
comment: The WGS84 latitude of a SpatialThing (decimal degrees).
domain: SpatialThing

longitude
type: AnnotationProperty
comment: The WGS84 longitude of a SpatialThing (decimal degrees).
domain: SpatialThing

ambient condition
type: ObjectProperty
domain: Detailed report of the safety related event
range: Concept
In SKOS Concept Scheme: AmbientConditions
created: 2023-09-30
comment: Qualitative description of the weather ambiant condiftions at the time of the occurrence.

applicable risk control measure function
type: ObjectProperty
domain: Risk control measure function
range: Concept
In SKOS Concept Scheme: ApplicableRiskControlMeasureFunction
created: 2023-09-30
comment: RCM Functions which are covered by a given risk control measure.

involvement of authorities
type: ObjectProperty
domain: Detailed report (TDG part)
range: Concept
In SKOS Concept Scheme: AuthoritiesInvolvementTypes
created: 2023-09-30
comment: Indication that authorities had to intervene to mitigate the consequences of an occurrence.

cause of the event type reported
type: ObjectProperty
domain: Simple report of the safety related event
range: Concept
In SKOS Concept Scheme: SafetyEventTypes
created: 2023-09-30
comment: Applicable lists of causes, as defined in CDR (EU) 2024/xxx, Annex I, Part C, Appendix 1, Reference lists of Category B events and Category C events.

contributing factor
type: ObjectProperty
domain: Class
  union of: Failed risk control measure
  union of: Occurrence scenario building block
range: Concept
In SKOS Concept Scheme: ContributingFactors
created: 2023-09-30
comment: ‘contributing factor’ means a contributing factor as defined in Article 2, point (2) of Commission Implementing Regulation (EU) 2020/5721, i.e means any action, omission, event or condition that affects an occurrence by increasing its likelihood, accelerating the effect in time or increasing the severity of the consequences, but the elimination of which would not have prevented the occurrence. In the context of CDR (EU) 2024/xxxx, applicable list of contributing factors is defined in Annex I, Part C, Appendix 2.

corresponds to risk control measure
type: ObjectProperty
domain: Failed risk control measure
range: Risk control measure
created: 2023-09-30
comment: Relates the failed risk control measure information with the corresponding risk control measure.

country of occurrence
type: ObjectProperty
domain: Class
  union of: Detailed report (TDG part)
  union of: Simple report of the safety related event
range: Concept
In SKOS Concept Scheme: country
created: 2023-09-30
comment: Country where the safety related event occurred.

country of operation
type: ObjectProperty
domain: Volume of operation
range: Concept
In SKOS Concept Scheme: country
created: 2023-09-30
comment: Country(ies) in which the railway operator operates. For Railway Undertakings, it corresponds to the list of countries applicable in accordance with the applicable (in force) safety certificate(s). For Infrastructure managers it coresponds to the list of countries applicable in accordance with the applicable (in force) safety authorisation(s).

damage level
type: ObjectProperty
domain: Detailed report (TDG part)
range: Concept
In SKOS Concept Scheme: DamageLevels
created: 2023-09-30

damage to rolling stock
type: ObjectProperty
domain: Detailed report of the safety related event
range: Rolling stock damage per vehicle type
created: 2023-09-30
comment: Relates the safety related event with the number of vehicles damaged broken down per type of damage (to vehicle) and vehicle type.

document access
type: ObjectProperty
domain: Document
range: Concept
In SKOS Concept Scheme: DocumentAccesses
created: 2023-09-30

document language
type: ObjectProperty
domain: Document
range: Concept
In SKOS Concept Scheme: DocumentLanguages
created: 2023-09-30
comment: Language(s) in which the document is available.

document status
type: ObjectProperty
domain: Document
range: Concept
In SKOS Concept Scheme: DocumentStatuses
created: 2023-09-30
comment: Language(s) in which the document is available.

document type
type: ObjectProperty
domain: Document
range: Concept
In SKOS Concept Scheme: DocumentTypes
created: 2023-09-30
comment: Type of document (e.g. report, note, e-mail...). Not ot confuse with the ICT format of the digital document.

estimated level of damage
type: ObjectProperty
domain: Detailed report (TDG part)
In SKOS Concept Scheme: EstimatedLevelDamagetTypes
created: 2023-10-25

evidence reference record
type: ObjectProperty
domain: Safety performance self-estimation per element
range: Document
created: 2023-09-30
comment: Relates the safety performance assessment per element with the corresponding evidence document.

failed in block
type: ObjectProperty
inverse of: has failed risk control measure
domain: Failed risk control measure
range: Occurrence scenario building block
created: 2023-09-30
comment: Relates the failed safety measure information with the corresponding occurrence scenario building block.

frequency safety level prior to the assessed period
type: ObjectProperty
domain: Safety level per type of operation
range: Concept
In SKOS Concept Scheme: SafetyLevels
created: 2023-09-30
comment: Frequency is the number of pre-defined type of occurrences divided by a given normaliser. Typical normalisers can be, for example, year, volume of transport (number of tons, number of tons/km) or number of predefined operations.

frequency safety level same as assessed period
type: ObjectProperty
domain: Safety level per type of operation
range: Concept
In SKOS Concept Scheme: SafetyLevels
created: 2023-09-30
comment: Frequency is the number of pre-defined type of occurrences divided by a given normaliser. Typical normalisers can be, for example, year, volume of transport (number of tons, number of tons/km) or number of predefined operations.

has failed risk control measure
type: ObjectProperty
domain: Occurrence scenario building block
range: Failed risk control measure
created: 2023-09-30
comment: Relates the occurrence scenario bulding block with the information on the failed risk control measure.

has information in record version
type: ObjectProperty
domain: Record version
range: Information in record version
created: 2023-09-30
comment: Relates a record version with the information it contains.

has occurrence scenario
type: ObjectProperty
domain: Detailed report of the safety related event
range: Occurrence scenario
created: 2023-09-30
comment: Relates a safety related event with an occurrence scenario.

has occurrence scenario building block
type: ObjectProperty
domain: Occurrence scenario
range: Occurrence scenario building block
created: 2023-09-30
comment: Relates the occurrence scenario with its building blocks.

has record attachment
type: ObjectProperty
domain: Record version
range: Record attachment
created: 2023-09-30
comment: Relates the record version that is being reported with files (e.g. documents, images, videoa) that are attachments to the record. .

has record version
type: ObjectProperty
domain: Record
range: Record version
created: 2023-09-30
comment: Relates a record with its versions.

has risk control measure function
type: ObjectProperty
domain: Risk control measure
range: Risk control measure function
created: 2023-09-30
comment: Relates the risk control mesure with the risk control measure functions.

has safety authorisation
type: ObjectProperty
domain: Entity
range: Safety authorisation
created: 2023-09-30

has safety certificate
type: ObjectProperty
domain: Entity
range: Safety certificate
created: 2023-09-30

has safety level per event type
type: ObjectProperty
domain: Safety level
range: Safety level per event type
created: 2023-09-30

has safety level per type of operation
type: ObjectProperty
domain: Safety level
range: Safety level per type of operation
created: 2023-09-30

human consequences per person category
type: ObjectProperty
domain: Class
  union of: Detailed report of the safety related event
  union of: Detailed report (TDG part)
  union of: Simple report of the safety related event
range: Human consequences per person category
created: 2023-09-30
comment: Relates the safety related event with the class that represents human consequences (victims) per person category (passengers, trespassers, employees, others).

total human consequences per injury type
type: ObjectProperty
domain: Simple report of the safety related event
range: Human consequences per injury type
created: 2023-09-30
comment: Relates the safety related event with the human consequences total per injury type (fatalities, serious injuries, light injuries).

injury dangerous goods type
type: ObjectProperty
domain: Human consequences per person category
range: Concept
In SKOS Concept Scheme: InjuryDGTypes
created: 2023-09-30
comment: Type of injury relating to human exposure to dangerous goods substances and associated dangerous phenomena.

injury type
type: ObjectProperty
domain: Class
  union of: Human consequences per person category
  union of: Human consequences per injury type
range: Concept
In SKOS Concept Scheme: InjuryTypes
created: 2023-09-30
comment: Type of injury in accordance with Directive (EU) 2016/798 and in accordance with the Abreviated Injuriy Scale (AIS).

input AND gate
type: ObjectProperty
domain: Occurrence scenario building block
range: Concept
In SKOS Concept Scheme: SafetyEventTypes
created: 2023-09-30
comment: Input to the AND gate of a building block.

input OR gate
type: ObjectProperty
domain: Occurrence scenario building block
range: Concept
created: 2023-09-30
comment: Input to the OR gate of a building block.

introduces threat of event occurrence
type: ObjectProperty
domain: Risk control measure
range: Concept
In SKOS Concept Scheme: EventTypes
created: 2023-09-30

introduces threat to event mitigation
type: ObjectProperty
domain: Risk control measure
range: Concept
created: 2023-09-30

introduces threat to new event
type: ObjectProperty
domain: Risk control measure
range: Concept
In SKOS Concept Scheme: SafetyEventTypes
created: 2023-09-30

is related to record
type: ObjectProperty
domain: Record
range: Record
created: 2023-09-30
comment: Reference to a record.

level crossing type
type: ObjectProperty
domain: Detailed report of the safety related event
range: Concept
In SKOS Concept Scheme: LevelCrossingTypes
created: 2023-09-30
comment: Type of level crossing in accordance with the applicable list of types.

light condition
type: ObjectProperty
domain: Detailed report of the safety related event
range: Concept
In SKOS Concept Scheme: LightConditions
created: 2023-09-30
comment: Light condition at the time and location of an occurrence.

line kilometer point
type: ObjectProperty
domain: Class
  union of: Detailed report (TDG part)
  union of: Simple report of the safety related event
created: 2023-09-30
comment: Relates the safety related event with the railway location (kilometer) relative to a railway line.

location details
type: ObjectProperty
domain: Detailed report of the safety related event
range: Concept
In SKOS Concept Scheme: LocationDetails
created: 2023-09-30
comment: Detailed description of the location at which an occurrence took place.

location in RINF
type: ObjectProperty
domain: Class
  union of: Detailed report (TDG part)
  union of: Simple report of the safety related event
created: 2023-09-30
comment: Relates the safety related event with the location in the RINF infrastructure.

loss of product
type: ObjectProperty
domain: Detailed report (TDG part)
range: Concept
In SKOS Concept Scheme: ProductLossTypes
created: 2023-09-30
comment: Relates to occurrences with dangerous goods involvement, in which a loss of containment of the dangerous substance (loss of product) occurred.

means of containment
type: ObjectProperty
domain: Detailed report (TDG part)
range: Concept
In SKOS Concept Scheme: MeansOfContainmentTypes
created: 2023-09-30
comment: Type of contianment of a dangerous good substance, in accordance with the list of applicable types defined in RID.

means of containment failure type
type: ObjectProperty
domain: Detailed report (TDG part)
range: Concept
In SKOS Concept Scheme: MeansContainmentFailureTypes
created: 2023-09-30
comment: Type of failure of the dangerous goods containment leading to the loss of containment, in accordance witht he applicable list of failure defined in RID.

mitigates event
type: ObjectProperty
domain: Risk control measure
range: Concept
In SKOS Concept Scheme: SafetyEventTypes
created: 2023-09-30
comment: Indicate that a risk control measure mitigates the impact of an occurrence.

notification type
type: ObjectProperty
domain: Notification
range: Concept
In SKOS Concept Scheme: NotificationTypes
created: 2023-09-30
comment: Type of notification in accordance with the ISS applicable types.

notified entity
type: ObjectProperty
domain: Class
  union of: Notification
  union of: Record
range: Entity
created: 2023-09-30
comment: ISS registered entity to which the notification is addressed.
alternative label: addressee

notifying entity
type: ObjectProperty
domain: Record
range: Entity
created: 2023-09-30
comment: In the case of detailed report, for indirect channel only; entity notifying the report on behalf the reporting entity. Taken from Detailed Report.xlsx template.

reporting entity
type: ObjectProperty
domain: Record
range: Entity
created: 2023-09-30
comment: ISS registered User issuing a notification on behalf a registered Entity.

operational cause
type: ObjectProperty
domain: Detailed report (TDG part)
range: Concept
In SKOS Concept Scheme: CauseTypes
created: 2023-09-30

output event
type: ObjectProperty
domain: Occurrence scenario building block
range: Concept
created: 2023-09-30
comment: Event type identitied as output of a building block. (Equivalent to ouput of the OR gate)

person category
type: ObjectProperty
domain: Class
  union of: Human consequences per person category
  union of: Human consequences per injury type
range: Concept
In SKOS Concept Scheme: http://data.europa.eu/949/iss/concepts/person-categories/PersonCategories
created: 2023-09-30
comment: Category of person in accordance with the Directive (EU) 2016/798 which is victim of an occurrence.

prevents event occurrence
type: ObjectProperty
domain: Risk control measure
range: Concept
In SKOS Concept Scheme: SafetyEventTypes
created: 2023-09-30
comment: Indicate that a risk control measure is able to prevent the listed event(s).

record status
type: ObjectProperty
domain: Record
range: Concept
In SKOS Concept Scheme: RecordStatuses
created: 2023-09-30
comment: This parameter shows the level of validity of the recorded information, as following: New, Updated, Submitted, Validated, Corrected. Only the applicable statuses for the record type can be selected. The status 'Validated' can be selected only if all the mandatory fields have been filled-out. The status 'Corrected' is an exception treatment applicable after 'Vlidation' or upon the notification of a justified request.

record type
type: ObjectProperty
domain: Record
range: Concept
In SKOS Concept Scheme: RecordTypes
created: 2023-09-30
comment: Applicable type of record in accordance with the applicable ISS version.

reporting entity role
type: ObjectProperty
domain: Record
range: Concept
In SKOS Concept Scheme: EntityCategories
created: 2023-09-30
comment: Role of the Entity when reporting a record in accordance with the applicable roles and applicable registration process defined by CDR (EU) 2024/xxxx, Annex IV, Part C .

reporting reason
type: ObjectProperty
domain: Record
range: Concept
In SKOS Concept Scheme: ReportingReasons
created: 2023-09-30
comment: Legal basis applicable for the reported record.

can be the result of failure of a risk control measure
type: ObjectProperty
domain: Failed risk control measure
range: Concept
In SKOS Concept Scheme: SafetyEventTypes
created: 2023-09-30
comment: List of possible resulting safety related events in case a given risk control measure fails to operate as planned.

risk control measure function
type: ObjectProperty
domain: Risk control measure
range: Concept
In SKOS Concept Scheme: RiskControlMeasureFunctionTypes
created: 2023-09-30
comment: RCM functions applied by an RCM in accordance with the applicable list of functions.

risk control measure required
type: ObjectProperty
domain: Safety performance self-estimation per area
range: Risk control measure
created: 2023-09-30

risk control measure type
type: ObjectProperty
domain: Risk control measure
range: Concept
In SKOS Concept Scheme: RiskControlMeasureTypes
created: 2023-09-30

rolling stock vehicle damage type
type: ObjectProperty
domain: Rolling stock damage per vehicle type
range: Concept
In SKOS Concept Scheme: RollingStockVehicleDamageTypes
created: 2023-09-30

rolling stock vehicle type
type: ObjectProperty
domain: Rolling stock damage per vehicle type
range: Concept
In SKOS Concept Scheme: RollingStockVehicleTypes
created: 2023-09-30

safety event type
type: ObjectProperty
domain: Class
  union of: Safety level per event type
  union of: Simple report of the safety related event
range: Concept
In SKOS Concept Scheme: http://data.europa.eu/949/iss/concepts/safety-event-types/SafetyEventTypes
created: 2023-09-30
comment: 'safety event type' or ‘event type’ means an event identified by an event name and an event code as defined in CDR (EU) xxx/2024, Annex I, Part C, Appendix 1.
alternative label: occurrence event type

safety level score
type: ObjectProperty
domain: Safety level per event type
range: Concept
In SKOS Concept Scheme: SafetyLevels
created: 2023-09-30

safety maturity level
type: ObjectProperty
domain: Safety performance self-estimation per area
range: Concept
In SKOS Concept Scheme: MaturityLevels
created: 2023-09-30

safety performance area
type: ObjectProperty
domain: Safety performance self-estimation per area
range: Concept
In SKOS Concept Scheme: SafetyPerformanceAreas
created: 2023-09-30

safety performance self-estimation element
type: ObjectProperty
domain: Safety performance self-estimation per element
range: Concept
In SKOS Concept Scheme: SafetyPerformanceAssessmentElements
created: 2023-09-30

safety performance self-estimation element number
type: ObjectProperty
domain: Safety performance self-estimation per element
range: Concept
In SKOS Concept Scheme: SafetyElementNumbers
created: 2023-09-30

safety performance self-estimation per area
type: ObjectProperty
domain: Safety performance self-estimation
range: Safety performance self-estimation per area
created: 2023-09-30

safety performance self-estimation per element
type: ObjectProperty
domain: Safety performance self-estimation per area
range: Safety performance self-estimation per element
created: 2023-09-30

severity safety level during the assessment period
type: ObjectProperty
domain: Safety level per type of operation
range: Concept
created: 2023-09-30
comment: The severity is Intensity of harm. The severity is estimated by the exposure of vulnerabilities to hazardous areas.

severity safety level prior to the assessment period
type: ObjectProperty
domain: Safety level per type of operation
range: Concept
In SKOS Concept Scheme: SafetyLevels
created: 2023-09-30
comment: The severity is Intensity of harm. The severity is estimated by the exposure of vulnerabilities to hazardous areas.

systemic factor
type: ObjectProperty
domain: Class
  union of: Failed risk control measure
  union of: Occurrence scenario building block
range: Concept
In SKOS Concept Scheme: SystemicFactors
created: 2023-09-30
comment: Systemic factors applicable to a given occurrence or to the failure of a risk control measure in accordance with the applicable list of factors defined in CDR (EU) 2024/xxxx, Annex I, Part C, Appendix 3.

targeted document
type: ObjectProperty
domain: Notification
range: Document
created: 2023-09-30
comment: Record that is the subject of the notification.

transport of dangerous goods location
type: ObjectProperty
domain: Detailed report (TDG part)
range: Concept
In SKOS Concept Scheme: TdgLocationTypes
created: 2023-09-30

transport of dangerous goods occurrence cause
type: ObjectProperty
domain: Detailed report (TDG part)
range: Concept
In SKOS Concept Scheme: TDGOccurrenceCauses
created: 2023-09-30

transport of dangerous goods occurrence description
type: ObjectProperty
domain: Detailed report (TDG part)
range: Concept
created: 2023-09-30
comment: Description of the specific properties of an occurrence involving dangerous goods, supplementing the other reports concerning the same occurrence. This description is consistent with properties reported in accordance with RID 1.8.5.

topography
type: ObjectProperty
domain: Detailed report (TDG part)
range: Concept
In SKOS Concept Scheme: TopographyTypes
created: 2023-09-30
comment: Qualitative description of the topography at the time and location of an occurrence.

track surface condition
type: ObjectProperty
domain: Detailed report of the safety related event
range: Concept
In SKOS Concept Scheme: TrackSurfaceConditions
created: 2023-09-30
comment: Condition of the surface at the time and location of an occurrence.

type of train movement
type: ObjectProperty
domain: Class
  union of: Detailed report of the safety related event
  union of: Simple report of the safety related event
range: Concept
In SKOS Concept Scheme: TrainMovementTypes
created: 2023-09-30

transport operation category
type: ObjectProperty
domain: Safety level per type of operation
domain: Simple report of the safety related event
range: Concept
In SKOS Concept Scheme: TransportOperationCategories
created: 2023-09-30

vehicle involved
type: ObjectProperty
domain: Class
  union of: Detailed report of the safety related event
  union of: Detailed report (TDG part)
range: Vehicle
created: 2023-09-30

weather condition
type: ObjectProperty
domain: Detailed report (TDG part)
range: Concept
In SKOS Concept Scheme: WeatherConditions
created: 2023-09-30
comment: Ambient condition and air temperature at the time and location of an occurrence.

location
type: ObjectProperty
domain: Simple report of the safety related event
range: Geometry
range: SpatialThing
created: 2023-09-30
comment: Location of the occurrence expressed with a reference point (long/lat/alt). The precision of the reference point shall be better than 0.001 for long and lat values.
comment: The relation between something and the point, or other geometrical thing in space, where it is. For example, the realtionship between a radio tower and a Point with a given lat and long. Or a relationship between a park and its outline as a closed arc of points, or a road and its location as a arc (a sequence of points). Clearly in practice there will be limit to the accuracy of any such statement, but one would expect an accuracy appropriate for the size of the object and uses such as mapping .

classification
type: ObjectProperty
domain: Organization
range: Concept
In SKOS Concept Scheme: EntityCategories
created: 2023-09-30
comment: Indica una classificazione per questa Organization all'interno di un qualche schema di classificazione. Alcuni vocabolari potrebbero voler specializzare questa proprietà per avere un codominio corrispondente a uno specifico `skos:ConceptScheme`. Si noti che la presenza di questa proprietà è ancora in fase di discussione e potrebbe essere revisionata o rimossa. @it
comment: Indicates a classification for this Organization within some classification scheme. Extension vocabularies may wish to specialize this property to have a range corresponding to a specific `skos:ConceptScheme`. This property is under discussion and may be revised or removed - in many cases organizations are best categorized by defining a sub-class hierarchy in an extension vocabulary.
comment: Indique une classification pour cette Organisation dans le cadre d'un schéma de classification. Il est possible de spécialiser cette propriété en utilisant un vocabulaire spécialisé pour que le champ corresponde à un concept spécifique `skos:ConceptScheme`. Cette propriété est en discussion est pourrait être révisée ou supprimée - dans de nombreux cas, les organisations sont mieux catégorisées par une hiérarchie de sous-classe dans un vocabulaire externe. @fr
comment: Ordenación jerárquica que se hace de una organización dentro de un esquema de clasificación. Es posible que algunos vocabularios especifiquen esta propiedad de forma que el rango se corresponda con un `skos:ConceptScheme` específico. La conveniencia de incluir esta propiedad se está debatiendo y puede que se revise o elimine (en muchos casos las organizaciones se clasifican mejor si se define una jerarquía de subclases en un vocabulario aparte) @es
comment: ある分類表内のこの組織に対する分類を示します。 アプリケーションがorg:Organizationのサブクラスを組織的なカテゴリーを表わす手段として定義することも許容されることに注意してください。 @ja
label: classificazione @it
label: pertenece a la clasificación @es

Kilometer
type: DatatypeProperty
domain: Railway location
range: double
XML name: OPRailwayLocation
appendix D2 index: 2.2.2
rinf index: 1.1.1.1.8.12.1
rinf index: 1.1.1.1.8.13.1
rinf index: 1.1.1.3.14.3
rinf index: 1.2.0.0.0.6
rinf index: 1.2.1.0.5.10.1
rinf index: 1.2.1.0.5.11.1
rinf index: 1.2.1.0.8.3
rinf index: 1.2.2.0.5.10.1
rinf index: 1.2.2.0.5.9.1
created: 2021-01-29
created: 2023-09-30
modified: 2021-01-29
source: oj
comment: Distance measured in kilometers from the origin of a national railway line. In https://eur-lex.europa.eu/eli/reg_impl/2019/773/oj 2.2.2 Principal locations (stations, yards, junctions, freight terminals) and their position relative to the line.
term status: stable

additional explanation of resources management
type: DatatypeProperty
domain: Risk control measure
range: string
created: 2023-09-30

additional explanation of risk control measure expected effectiveness
type: DatatypeProperty
domain: Risk control measure
range: string
created: 2023-09-30

additional explanation of risk control measure normal functioning
type: DatatypeProperty
domain: Risk control measure
range: string
created: 2023-09-30

additional explanation of risk control emasure threats
type: DatatypeProperty
domain: Risk control measure
range: string
created: 2023-09-30

air pollution
type: DatatypeProperty
domain: Detailed report of the safety related event
range: string
created: 2023-09-30

air temperature and ambient condition narrative
type: DatatypeProperty
domain: Detailed report of the safety related event
range: string
created: 2023-09-30
comment: free text in accordance with Appendix D – General Part, section 3.2.

assessment period end date
type: DatatypeProperty
domain: Class
  union of: Safety authorisation
  union of: Safety performance self-estimation
range: date
created: 2023-09-30

assessment period start date
type: DatatypeProperty
domain: Class
  union of: Safety authorisation
  union of: Safety performance self-estimation
range: date
created: 2023-09-30

cargo number
type: DatatypeProperty
domain: Detailed report of the safety related event
range: string
created: 2023-09-30

cargo speed
type: DatatypeProperty
domain: Detailed report of the safety related event
range: float
created: 2023-09-30

certificate end date
type: DatatypeProperty
domain: Safety certificate
range: date
created: 2023-09-30

certificate start date
type: DatatypeProperty
domain: Safety certificate
range: date
created: 2023-09-30

reporting contact ID for the occurrence context
type: DatatypeProperty
sub property of: identifier
domain: Detailed report of the safety related event
range: string
created: 2023-09-30

damage to the environment narrative
type: DatatypeProperty
domain: Detailed report of the safety related event
range: string
created: 2023-09-30
comment: Environmentat damage, for example, pollution or contamination of land, air, waters, intoxication of wildlife or livestock.
comment: Free text in accordance with Appendix D – General Part, section 3.2.

damage to infrastructure narrative
type: DatatypeProperty
domain: Detailed report of the safety related event
range: string
created: 2023-09-30

damage to operating services narrative
type: DatatypeProperty
domain: Detailed report of the safety related event
range: string
created: 2023-09-30
comment: Damage to the railway system operations, for example, disruption of railway services (passenger, freight, dangerous goods transport).
comment: Free text in accordance with Appendix D – General Part, section 3.2.

damage to the Rolling Stock narrative
type: DatatypeProperty
domain: Detailed report of the safety related event
range: string
created: 2023-09-30
comment: Free text in accordance with Appendix D – General Part, section 3.2.

damages for the reporting entity (monetised)
type: DatatypeProperty
domain: Simple report of the safety related event
range: float
created: 2023-09-30
comment: Damages is the outcome of hazardous events in which vulnerabilities are exposed to hazards (see exposure). Damage may be quantified or qualified by the measurement of its severity. Damage are equivalent to harm in the case of human or animal vulnerabilities.

deemed cause(s) narrative
type: DatatypeProperty
domain: Class
  union of: Detailed report (TDG part)
  union of: Simple report of the safety related event
range: string
created: 2023-09-30
comment: Free text (optional), Only to be used if needed for better understanding of the reported dataset. Taken from Annexes ISC-2022-00728_2023-07.

document copyright
type: DatatypeProperty
domain: Document
range: string
created: 2023-09-30

document ID
type: DatatypeProperty
sub property of: identifier
domain: Document
range: string
created: 2023-09-30

document title
type: DatatypeProperty
domain: Document
range: string
created: 2023-09-30

document version
type: DatatypeProperty
domain: Document
range: string
created: 2023-09-30

estimated cost of depollution
type: DatatypeProperty
domain: Detailed report of the safety related event
range: float
created: 2023-09-30

estimated cost of operation disruption
type: DatatypeProperty
domain: Detailed report of the safety related event
range: float
created: 2023-09-30

estimated cost of operation disruption for freight service
type: DatatypeProperty
domain: Detailed report of the safety related event
range: float
created: 2023-09-30

estimated cost of operation disruption for TDG freight service
type: DatatypeProperty
domain: Detailed report of the safety related event
range: float
created: 2023-09-30

estimated cost of operation disruption for terminal service
type: DatatypeProperty
domain: Detailed report of the safety related event
range: float
created: 2023-09-30

estimated damage to built surrounding
type: DatatypeProperty
domain: Detailed report of the safety related event
range: float
created: 2023-09-30

estimated quantity of loss of product (kg or l)
type: DatatypeProperty
domain: Detailed report (TDG part)
range: float
created: 2023-09-30

exact location of occurrence - positioning norm applied
type: DatatypeProperty
domain: Simple report of the safety related event
range: string
created: 2023-09-30

failure mode
type: DatatypeProperty
domain: Failed risk control measure
range: string
created: 2023-09-30

failure analysis
type: DatatypeProperty
domain: Failed risk control measure
range: string
created: 2023-09-30

frequency probability during assessment period
type: DatatypeProperty
domain: Safety level per type of operation
range: float
created: 2023-09-30
comment: Frequency is the number of pre-defined type of occurrences divided by a given normaliser. Typical normalisers can be, for example, year, volume of transport (number of tons, number of tons/km) or number of predefined operations.

frequency probability prior to assessment period
type: DatatypeProperty
domain: Safety level per type of operation
range: float
In SKOS Concept Scheme: SafetyLevels
created: 2023-09-30
comment: Frequency is the number of pre-defined type of occurrences divided by a given normaliser. Typical normalisers can be, for example, year, volume of transport (number of tons, number of tons/km) or number of predefined operations.

occurrence narrative (general)
type: DatatypeProperty
domain: Simple report of the safety related event
range: string
created: 2023-09-30

is a dangerous goods event
type: DatatypeProperty
domain: Simple report of the safety related event
range: boolean
date: 2023-10-25

is the element fullfiled
type: DatatypeProperty
domain: Safety performance self-estimation per element
range: boolean
created: 2023-09-30

length of track (rail) damaged
type: DatatypeProperty
domain: Detailed report of the safety related event
range: float
created: 2023-09-30

length of track substructure damaged
type: DatatypeProperty
domain: Detailed report of the safety related event
range: float
created: 2023-09-30

length of track superstructure damaged
type: DatatypeProperty
domain: Detailed report of the safety related event
range: float
created: 2023-09-30

light conditions narrative
type: DatatypeProperty
domain: Detailed report of the safety related event
range: string
created: 2023-09-30
comment: Free text in accordance with Appendix D – General Part, section 3.2.

location details narrative
type: DatatypeProperty
domain: Detailed report of the safety related event
range: string
created: 2023-10-25
comment: Free text in accordance with Appendix D – General Part, section 3.2.

means of containment material
type: DatatypeProperty
domain: Detailed report (TDG part)
range: string
created: 2023-09-30

measuring or monitoring
type: DatatypeProperty
domain: Risk control measure
range: string
created: 2023-10-25
comment: Description of leading and/or lagging indicators

minutes of delay for freight trains
type: DatatypeProperty
domain: Detailed report of the safety related event
range: float
created: 2023-09-30

minutes of delay for passenger trains
type: DatatypeProperty
domain: Detailed report of the safety related event
range: float
created: 2023-09-30

damages (monetised)
type: DatatypeProperty
domain: Simple report of the safety related event
range: float
created: 2023-09-30
comment: Damages is the outcome of hazardous events in which vulnerabilities are exposed to hazards (see exposure). Damage may be quantified or qualified by the measurement of its severity. Damage are equivalent to harm in the case of human or animal vulnerabilities.

network
type: DatatypeProperty
domain: Safety authorisation
range: string
created: 2023-09-30

notification legal basis
type: DatatypeProperty
domain: Notification
domain: Record
range: string
created: 2023-09-30

notification message
type: DatatypeProperty
domain: Notification
range: string
created: 2023-09-30

number and speed of train/vehicle/cargo -narrative
type: DatatypeProperty
domain: Detailed report of the safety related event
range: string
created: 2023-09-30
comment: Free text in accordance with Appendix D – General Part, section 3.2.

number of DG freight ton kilometers
type: DatatypeProperty
domain: Volume of operation
range: float
created: 2023-09-30

number of DG freight train kilometers
type: DatatypeProperty
domain: Volume of operation
range: float
created: 2023-09-30

number of DG railway vehicles processed freight terminals
type: DatatypeProperty
domain: Volume of operation
range: integer
created: 2023-09-30

number of delayed freight trains
type: DatatypeProperty
domain: Detailed report of the safety related event
range: integer
created: 2023-09-30

number of delayed passenger trains
type: DatatypeProperty
domain: Detailed report of the safety related event
range: integer
created: 2023-09-30

number of freight ton kilometers
type: DatatypeProperty
domain: Volume of operation
range: float
created: 2023-09-30

number of freight train kilometers
type: DatatypeProperty
domain: Volume of operation
range: float
created: 2023-09-30

number of line kilometers
type: DatatypeProperty
domain: Volume of operation
range: float
created: 2023-09-30

number of vehicles
type: DatatypeProperty
domain: Rolling stock damage per vehicle type
range: integer
created: 2023-09-30

number of victims
type: DatatypeProperty
domain: Human consequences per person category
range: integer
comment: Total number of persons for the occurrence. Taken from Annexes ISC-2022-00728_2023-07.

number of operated terminals
type: DatatypeProperty
domain: Volume of operation
range: integer
created: 2023-09-30

number of operated track kilometers
type: DatatypeProperty
domain: Volume of operation
range: integer
created: 2023-09-30

number of operating hours terminals
type: DatatypeProperty
domain: Volume of operation
range: integer
created: 2023-09-30

number of passenger kilometers
type: DatatypeProperty
domain: Volume of operation
range: float
created: 2023-09-30

number of passenger kilometers high speed service
type: DatatypeProperty
domain: Volume of operation
range: float
created: 2023-09-30

number of passenger train kilometers
type: DatatypeProperty
domain: Volume of operation
range: float
created: 2023-09-30

number of railway vehicles DG processed terminals
type: DatatypeProperty
domain: Volume of operation
range: integer
created: 2023-09-30

number of railway vehicles processed freight terminals
type: DatatypeProperty
domain: Volume of operation
range: integer
created: 2023-09-30

number of railway vehicles processed terminals
type: DatatypeProperty
domain: Volume of operation
range: integer
created: 2023-09-30

number of switches, points damaged
type: DatatypeProperty
domain: Detailed report of the safety related event
range: integer
created: 2023-09-30

number of total train kilometers
type: DatatypeProperty
domain: Volume of operation
range: float
created: 2023-09-30

number of track kilometers operated terminals
type: DatatypeProperty
domain: Volume of operation
range: float
range: integer
created: 2023-09-30

number of wagons carrying Dangerous Goods in the train
type: DatatypeProperty
domain: Simple report of the safety related event
range: integer
created: 2023-09-30

number of TDG Wagons Involved in the occurrence
type: DatatypeProperty
domain: Simple report of the safety related event
range: integer
created: 2023-09-30

occurrence location narrative
type: DatatypeProperty
domain: Simple report of the safety related event
range: string
created: 2023-09-30

occurrence consequences narrative
type: DatatypeProperty
domain: Class
  union of: Detailed report (TDG part)
  union of: Simple report of the safety related event
range: string
created: 2023-09-30
comment: Free text (optional), Only to be used if needed for better understanding of the reported dataset. Taken from Annexes ISC-2022-00728_2023-07.

occurrence context narrative
type: DatatypeProperty
domain: Simple report of the safety related event
range: string
created: 2023-09-30

occurrence date and time
type: DatatypeProperty
domain: Class
  union of: Detailed report (TDG part)
  union of: Simple report of the safety related event
range: dateTime
created: 2023-09-30

occurrence department
type: DatatypeProperty
domain: Class
  union of: Detailed report (TDG part)
  union of: Simple report of the safety related event
range: string
created: 2023-09-30

occurrence details narrative
type: DatatypeProperty
domain: Class
  union of: Detailed report of the safety related event
  union of: Detailed report (TDG part)
range: string
created: 2023-09-30
comment: Free text (optional), Only to be used if needed for better understanding of the reported dataset. Taken from Annexes ISC-2022-00728_2023-07.

occurrence ID
type: DatatypeProperty
sub property of: identifier
domain: Simple report of the safety related event
range: string
created: 2023-09-30

occurrence region
type: DatatypeProperty
domain: Class
  union of: Detailed report (TDG part)
  union of: Simple report of the safety related event
range: string
created: 2023-09-30

occurrence scenario narrative
type: DatatypeProperty
domain: Occurrence scenario
range: string
created: 2023-09-30

occurrence title
type: DatatypeProperty
domain: Simple report of the safety related event
range: string
created: 2023-09-30

occurrence town or city
type: DatatypeProperty
domain: Class
  union of: Detailed report (TDG part)
  union of: Simple report of the safety related event
range: string
created: 2023-09-30

overall result
type: DatatypeProperty
domain: Safety performance self-estimation
range: float
created: 2023-09-30

packing group
type: DatatypeProperty
domain: Detailed report (TDG part)
range: string
created: 2023-10-25

position failed risk control measure
type: DatatypeProperty
domain: Failed risk control measure
range: integer
created: 2023-09-30

record date and time
type: DatatypeProperty
domain: Record
range: dateTime
created: 2023-09-30

record ID
type: DatatypeProperty
domain: Record
range: string
created: 2023-09-30

record title
type: DatatypeProperty
domain: Record
range: string
created: 2023-09-30

record version number
type: DatatypeProperty
domain: Record version
range: string
created: 2023-09-30

reference period end date
type: DatatypeProperty
domain: Class
  union of: Safety authorisation
  union of: Safety performance self-estimation
range: date
created: 2023-09-30

reference period start date
type: DatatypeProperty
domain: Class
  union of: Safety authorisation
  union of: Safety performance self-estimation
range: date
created: 2023-09-30

reporting contact email
type: DatatypeProperty
domain: Record
range: string
created: 2023-10-25

reportingContactFax
type: DatatypeProperty
domain: Detailed report (TDG part)
range: string
created: 2023-10-25
comment: tdg reporting contact fax

reporting contact ID
type: DatatypeProperty
sub property of: identifier
domain: Record
range: string
created: 2023-09-30

reporting contact ID for the Occurrence consequences
type: DatatypeProperty
sub property of: identifier
domain: Detailed report of the safety related event
range: string
created: 2023-09-30

reporting contact name
type: DatatypeProperty
domain: Record
range: string
created: 2023-10-25

reporting period end date
type: DatatypeProperty
domain: Class
  union of: Notification
  union of: Volume of operation
range: date
created: 2023-09-30

reporting period start date
type: DatatypeProperty
domain: Class
  union of: Notification
  union of: Volume of operation
range: date
created: 2023-09-30

resources maintenance
type: DatatypeProperty
domain: Risk control measure
range: float
created: 2023-09-30

resources operation
type: DatatypeProperty
domain: Risk control measure
range: float
created: 2023-09-30

resources setting up
type: DatatypeProperty
domain: Risk control measure
range: float
created: 2023-09-30

risk analysis
type: DatatypeProperty
domain: Risk control measure
range: string
created: 2023-09-30

risk control measure aim
type: DatatypeProperty
domain: Risk control measure
range: string
created: 2023-09-30

risk control measure expected effectiveness
type: DatatypeProperty
domain: Risk control measure
range: float
created: 2023-09-30

risk control measure function description
type: DatatypeProperty
domain: Risk control measure function
range: string
created: 2023-09-30

risk control measure function name
type: DatatypeProperty
domain: Risk control measure function
range: string
created: 2023-09-30

risk control measure ID
type: DatatypeProperty
sub property of: identifier
domain: Risk control measure
range: string
created: 2023-09-30

risk control measure name
type: DatatypeProperty
domain: Risk control measure
range: string
created: 2023-09-30

safety result per area
type: DatatypeProperty
domain: Safety performance self-estimation per area
range: float
created: 2023-09-30

scope
type: DatatypeProperty
domain: Safety authorisation
range: string
created: 2023-09-30

self estimation narrative
type: DatatypeProperty
domain: Safety performance self-estimation
range: string
created: 2023-09-30

severity probability during assessment period
type: DatatypeProperty
domain: Safety level per type of operation
range: float
In SKOS Concept Scheme: SafetyLevels
created: 2023-09-30
comment: The severity is Intensity of harm. The severity is estimated by the exposure of vulnerabilities to hazardous areas.

severity probability prior to assessment period
type: DatatypeProperty
domain: Safety level per type of operation
range: float
created: 2023-09-30
comment: The severity is Intensity of harm. The severity is estimated by the exposure of vulnerabilities to hazardous areas.

soil pollution
type: DatatypeProperty
domain: Detailed report of the safety related event
range: string
created: 2023-09-30

supporting document effected effectiveness
type: DatatypeProperty
domain: Risk control measure
range: anyURI
created: 2023-09-30

supporting document measuring monitoring
type: DatatypeProperty
domain: Risk control measure
range: anyURI

supportingDocumentResourcesManagement
type: DatatypeProperty
domain: Risk control measure
range: anyURI
created: 2023-09-30

supporting document resources management
type: DatatypeProperty
domain: Detailed report (TDG part)
range: anyURI
created: 2023-09-30

tdg class
type: DatatypeProperty
domain: Detailed report (TDG part)
range: string
created: 2023-09-30

tdg company address
type: DatatypeProperty
domain: Detailed report (TDG part)
range: string
created: 2023-09-30

tdg company fax number
type: DatatypeProperty
domain: Detailed report (TDG part)
range: string
created: 2023-09-30

tdg company telephone
type: DatatypeProperty
domain: Detailed report (TDG part)
range: string
created: 2023-09-30

EVN number of the wagon concerned
type: DatatypeProperty
domain: Detailed report (TDG part)
range: string
created: 2023-10-25

tdg total number of deaths
type: DatatypeProperty
domain: Detailed report (TDG part)
range: integer
created: 2023-09-30

tdg total number of injuries
type: DatatypeProperty
domain: Detailed report (TDG part)
range: integer
created: 2023-09-30

temperature
type: DatatypeProperty
domain: Class
  union of: Detailed report of the safety related event
  union of: Detailed report (TDG part)
range: float
created: 2023-09-30

total cost of infrastructure damage
type: DatatypeProperty
domain: Detailed report of the safety related event
range: float
created: 2023-09-30

total cost rolling stock damage
type: DatatypeProperty
domain: Detailed report of the safety related event
range: float
created: 2023-09-30

total length of track damaged
type: DatatypeProperty
domain: Detailed report of the safety related event
range: float
created: 2023-09-30

total number of damaged vehicles
type: DatatypeProperty
domain: Detailed report of the safety related event
range: integer
created: 2023-09-30

total number of victims
type: DatatypeProperty
domain: Human consequences per injury type
range: integer
comment: Breakdown of the total numbers of Fatalities/Serious injuries/Light injuries per category of persons (passenger/employee/trespasser/other). Taken from Annexes ISC-2022-00728_2023-07.

total number of overturned vehicles
type: DatatypeProperty
domain: Detailed report of the safety related event
range: integer
created: 2023-09-30

total number of wagons leaking
type: DatatypeProperty
domain: Detailed report of the safety related event
range: integer
created: 2023-09-30

track surface condition narrative
type: DatatypeProperty
domain: Detailed report of the safety related event
range: string
created: 2023-09-30
comment: Free text in accordance with Appendix D – General Part, section 3.2.

train number
type: DatatypeProperty
domain: Detailed report of the safety related event
range: string
created: 2023-09-30

train speed
type: DatatypeProperty
domain: Detailed report of the safety related event
range: float
created: 2023-09-30

type of movement narrative
type: DatatypeProperty
domain: Detailed report of the safety related event
range: string
created: 2023-09-30
comment: Free text in accordance with Appendix D – General Part, section 3.2.

UN number
type: DatatypeProperty
domain: Detailed report (TDG part)
range: string
created: 2023-09-30

validity period end date
type: DatatypeProperty
domain: Safety authorisation
range: date
created: 29023-09-30

validity period start date
type: DatatypeProperty
domain: Safety authorisation
range: date
created: 2023-09-30

vehicle speed
type: DatatypeProperty
domain: Detailed report of the safety related event
range: float
created: 2023-09-30

water pollution
type: DatatypeProperty
domain: Detailed report of the safety related event
range: string
created: 2023-09-30

asWKT
type: DatatypeProperty
sub property of: hasSerialization
domain: Geometry
range: wktLiteral
contributor: Matthew Perry
creator: OGC GeoSPARQL 1.0 Standard Working Group
date: 2011-06-16
description: The WKT serialization of a geometry
created: 2023-09-30

Feature
type: Class

Infrastructure object
type: Class
subclass of: Feature
created: 2022-07-07
modified: 2022-10-27
comment: This class encompasses all those classes that represent features that are implemented in the European railway infrastructure. It is a subclass of the ERA Feature that has a spatial representation. It covers tracks, platforms, signals, tunnels, operational points, and sections of line. A feature that belongs to the infrastructure can be abstracted (hasAbstraction) as a topological object. It also is related to the infrastructure manager through the property infrastructureMgr.

Railway location
type: Class
created: 2021-01-29
modified: 2021-01-29
comment: A reference to a specific national railway line.
comment: Railway location
term status: stable
alternative label: Linear reference

Vehicle
type: Class
created: 2020-11-22
modified: 2020-11-22
comment: A specific vehicle or wagon able to operate over railway lines.
term status: stable

Detailed report of the safety related event
type: Class
subclass of: Information in record version
created: 2023-09-30
comment: Report on an occurrence as defined in CDR (EU) 2024/xxxx, Annex I, Part A.
alternative label: Detailed report of the occurrence

Detailed report (TDG part)
type: Class
subclass of: Information in record version
created: 2023-09-30
comment: Supplement to an occurrence detailed report when the occurrence is involving the transport of dangerous goods in accordance with RID 1.8.5.

Document
type: Class
subclass of: Information in record version
created: 2023-09-30
comment: Any form of document whose type is specified by a document type. In the context of CDR (EU) 2024/xxxx, it is used to comply with the requirements for reporting supporting evidence with the Information Sharing System using the dataset defined in CDR (EU) 2024/xxxx, Annex IV, Part C .

Entity
type: Class
subclass of: Organization
created: 2023-09-30

Failed risk control measure
type: Class
subclass of: Information in record version
created: 2023-09-30
comment: A risk control measure which did not operate as planned whose failure can be described in accordance with CDR (EU) 2024/xxxx Annex I, Part B, section 6.3.

Human consequences per person category
type: Class
created: 2023-09-30
comment: Breakdown of the total numbers of Fatalities/Serious injuries/Light injuries per category of persons (passenger/employee/trespasser/other). Taken from Annexes ISC-2022-00728_2023-07.

Human consequences per injury type
type: Class
created: 2023-09-30
comment: This class indicates for each injury type the total number of persons injured in the occurence.

Information in record version
type: Class
created: 2023-09-30

Notification
type: Class
subclass of: Information in record version
created: 2023-09-30
comment: A communication of data and information between two or more entities which can be performed with the Information Sharing System in accordance with CDR (EU) 2024/xxxx using the dataset defined in Annex IV, part D.

Occurrence scenario
type: Class
subclass of: Information in record version
created: 2023-09-30
comment: Description of the combination of events leading to an ocuurrence. In the context of CDR (EU) 2024/xxxx the reporting of occurrence scenarios shall implement the method and the applicable datasets described in Annex I, Part B.

Occurrence scenario building block
type: Class
subclass of: Restriction
  on class: Concept
  max qualified cardinality: 2
  on property: input AND gate
subclass of: Restriction
  on class: Concept
  max qualified cardinality: 2
  on property: input OR gate
subclass of: Restriction
  on class: Concept
  max qualified cardinality: 1
  on property: output event
created: 2023-09-30
comment: Generic element used for the description of occurrence scenarios or fault trees. Bluiding blocks shall be used to compose the description of an occurrence scenario in accordance with the method defined in CDR (EU) 2024/xxxx, Annex I, Part B.

Record
type: Class
created: 2023-09-30
comment: Digital document defined by a list of attributes and the values they take at the time of recording.

Record attachment
type: Class
subclass of: DigitalDocument
created: 2023-09-30
comment: Document linked to a record

Record version
type: Class
created: 2023-09-30

Risk control measure
type: Class
subclass of: Information in record version
created: 2023-09-30
comment: 'Risk control measure’ or ‘RCM’ means one of the safety measures as defined in Article 3, second paragraph, point (10) of Commission Implementing Regulation (EU) No 402/2013.
alternative label: Safety measure

Risk control measure function
type: Class
created: 2023-09-30
comment: “Risk control measure function” or “RCMF” means a function designed to contribute to the reduction of risks. The CDR (EU) 2024/xxxx defines the applicable functions as following: “detect function” means a function detecting a specified undesirable situation applicable to the linked event types; “diagnose function” means a function evaluating the detected undesirable situation, taking into account its context, and deciding whether or not an action needs to be performed; “act function” means a function that is designed to avoid the occurrence of the linked event types, or will directly reduce its consequences, or both.

Rolling stock damage per vehicle type
type: Class
created: 2023-09-30

Safety authorisation
type: Class
created: 2023-09-30

Safety certificate
type: Class
created: 2023-09-30

Safety level
type: Class
subclass of: Information in record version
created: 2023-09-30
comment: ‘safety level’ means a level of safety risks as estimated and assessed by the methods set out in Part A of the Annex III of CDR (EU) 2024/xxxx

Safety level per event type
type: Class
created: 2023-09-30

Safety level per type of operation
type: Class
created: 2023-09-30

Safety performance self-estimation
type: Class
subclass of: Information in record version
created: 2023-09-30
comment: Self-estimation of safety performance of an Entity reported with the dataset applicable in accordance with CDR (EU) 2024/xxxx, Annex II, Part B.

Safety performance self-estimation per element
type: Class
created: 2023-09-30
comment: Safety performance self-estimation per elements of proofs in accordance with CDR (EU) 2024/xxxx, Annex II, part C.

Safety performance self-estimation per area
type: Class
created: 2023-09-30
comment: Safety performance self-estimation per area (Plan, Do, Check, Act) in accordance with CDR (EU) 2024/xxxx, Annex II, part C.

Safety related event
type: Class
equivalent class: Class
  union of: Detailed report of the safety related event
  union of: Detailed report (TDG part)
  union of: Simple report of the safety related event
subclass of: Information in record version
created: 2023-09-30
comment: Equivalent to Occurrence. In the context of CDR (EU) 2024/xxxx, the features of an Occurrence/safety related event shall be reported using the datasets defined in Annex I, Part A.
alternative label: Occurrence

Simple report of the safety related event
type: Class
subclass of: Information in record version
created: 2023-09-30
comment: ‘occurrence’ means a safety relevant event, incident or accident
alternative label: Simple report of the occurrence

Volume of operation
type: Class
subclass of: Information in record version
created: 2023-09-30
comment: Volume of operation of railway operators over a defined period of tme. In the context of CDR (EU) 2024/xxxx, the volumes of operations shall be reported in accordance ith the dataset defined in Annex III, Part D.

Geometry
type: Class
subclass of: SpatialObject
contributor: Matthew Perry
creator: OGC GeoSPARQL 1.0 Standard Working Group
date: 2011-06-16
description: The class represents the top-level geometry type. This class is equivalent to the UML class GM_Object defined in ISO 19107, and it is superclass of all geometry types.
created: 2023-09-30

Curve
type: Class
subclass of: Geometry
created: 2023-09-30
comment: A Curve is a 1-dimensional geometric object usually stored as a sequence of Points, with the subtype of Curve specifying the form of the interpolation between Points. This specification defines only one subclass of Curve, LineString, which uses linear interpolation between Points. A Curve is a 1-dimensional geometric object that is the homeomorphic image of a real, closed, interval. A Curve is simple if it does not pass through the same Point twice with the possible exception of the two end points. A Curve is closed if its start Point is equal to its end Point. The boundary of a closed Curve is empty. A Curve that is simple and closed is a Ring. The boundary of a non-closed Curve consists of its two end Points. A Curve is defined as topologically closed, that is, it contains its endpoints f(a) and f(b).

Geometry
type: Class
subclass of: Geometry
created: 2023-09-30
comment: Geometry is the root class of the hierarchy. The instantiable subclasses of Geometry are restricted to 0, 1 and 2-dimensional geometric objects that exist in 2, 3 or 4-dimensional coordinate space (R2, R3 or R4). Geometry values in R2 have points with coordinate values for x and y. Geometry values in R3 have points with coordinate values for x, y and z or for x, y and m. Geometry values in R4 have points with coordinate values for x, y, z and m. The interpretation of the coordinates is subject to the coordinate reference systems associated to the point. All coordinates within a geometry object should be in the same coordinate reference systems. Each coordinate shall be unambiguously associated to a coordinate reference system either directly or through its containing geometry. The z coordinate of a point is typically, but not necessarily, represents altitude or elevation. The m coordinate represents a measurement. All Geometry classes described in this specification are defined so that instances of Geometry are topologically closed, i.e. all represented geometries include their boundary as point sets. This does not affect their representation, and open version of the same classes may be used in other circumstances, such as topological representations.

Geometry Collection
type: Class
subclass of: Geometry
created: 2023-09-30
comment: A GeometryCollection is a geometric object that is a collection of some number of geometric objects. All the elements in a GeometryCollection shall be in the same Spatial Reference System. This is also the Spatial Reference System for the GeometryCollection. GeometryCollection places no other constraints on its elements. Subclasses of GeometryCollection may restrict membership based on dimension and may also place other constraints on the degree of spatial overlap between elements.

Point
type: Class
subclass of: Geometry
created: 2023-09-30
comment: A Point is a 0-dimensional geometric object and represents a single location in coordinate space. A Point has an x-coordinate value, a y-coordinate value. If called for by the associated Spatial Reference System, it may also have coordinate values for z and m. The boundary of a Point is the empty set.

Surface
type: Class
subclass of: Geometry
created: 2023-09-30
comment: A Surface is a 2-dimensional geometric object. A simple Surface may consists of a single patch that is associated with one exterior boundary and 0 or more interior boundaries. A single such Surface patch in 3-dimensional space is isometric to planar Surfaces, by a simple affine rotation matrix that rotates the patch onto the plane z = 0. If the patch is not vertical, the projection onto the same plane is an isomorphism, and can be represented as a linear transformation, i.e. an affine. Polyhedral Surfaces are formed by stitching together such simple Surfaces patches along their common boundaries. Such polyhedral Surfaces in a 3-dimensional space may not be planar as a whole, depending on the orientation of their planar normals. If all the patches are in alignment (their normals are parallel), then the whole stitched polyhedral surface is co-planar and can be represented as a single patch if it is connected. The boundary of a simple Surface is the set of closed Curves corresponding to its exterior and interior boundaries. A Polygon is a simple Surface that is planar. A PolyhedralSurface is a simple surface, consisting of some number of Polygon patches or facets. If a PolyhedralSurface is closed, then it bounds a solid. A MultiSurface containing a set of closed PolyhedralSurfaces can be used to represent a Solid object with holes.

point
type: Class
subclass of: SpatialThing
comment: Uniquely identified by lat/long/alt. i.e. spaciallyIntersects(P1, P2) :- lat(P1, LAT), long(P1, LONG), alt(P1, ALT), lat(P2, LAT), long(P2, LONG), alt(P2, ALT). sameThing(P1, P2) :- type(P1, Point), type(P2, Point), spaciallyIntersects(P1, P2).
comment: A point, typically described using a coordinate system relative to Earth, such as WGS84.

SpatialThing
type: Class
comment: Anything with spatial extent, i.e. size, shape, or position. e.g. people, places, bowling balls, as well as abstract areas like cubes.

Organization
type: Class
subclass of: Agent
created: 2023-09-30
comment: Grupo de personas que se organiza en una comunidad u otro tipo de estructura social, comercial o política. Dicho grupo tiene un objetivo o motivo común para su existencia que va más allá del conjunto de personas que lo forman y que puede actuar como “agente”. A menudo las organizaciones se pueden agrupar en estructuras jerárquicas. Se recomienda el uso de etiquetas de SKOS para denominar a cada “organización”. En concreto, `skos:prefLabel` para la denominación principal o recomendada (aquella reconocida legalmente, siempre que sea posible), `skos:altLabel` para denominaciones alternativas (nombre comercial, sigla, denominación por la que se conoce a la organización coloquialmente) y `skos:notation` para referirse al código que identifique a la organización en una lista de códigos. Denominaciones alternativas: _colectivo_ _corporación_ _grupo_ @es
comment: Rappresenta una collezione di persone organizzate all'interno di una communità o di una qualche struttura sociale, commerciale o politica. Il gruppo condivide un obiettivo o una ragione d'essere che va oltre gli stessi membri appartenenti al gruppo e può agire come un Agent. Le organizzazioni si possono spesso suddividere in strutture gerarchiche. Si raccomanda di usare le label per l'Organization mediante le proprietà di SKOS. In particolare, `skos:prefLabel` per il nome principale (possibilmente un nome legalmente riconosciuto)”, `skos:altLabel` come nome alternativo (denominazione commerciale, denominazione colloquiale) e `skos:notation` per indicare un codice di una lista di codici. @it
comment: Represents a collection of people organized together into a community or other social, commercial or political structure. The group has some common purpose or reason for existence which goes beyond the set of people belonging to it and can act as an Agent. Organizations are often decomposable into hierarchical structures. It is recommended that SKOS lexical labels should be used to label the Organization. In particular `skos:prefLabel` for the primary (possibly legally recognized name), `skos:altLabel` for alternative names (trading names, colloquial names) and `skos:notation` to denote a code from a code list. Alternative names: _Collective_ _Body_ _Org_ _Group_
comment: Représente un groupe de personnes organisées en communauté où tout autre forme de structure sociale, commerciale ou politique. Le groupe a un but commun ou une raison d'être qui va au-delà de la somme des personnes qui en font partie et peut agir en tant que "Agent". Les organisations sont souvent décomposables en structures hiérarchisées. Il est recommandé que des labels lexicaux SKOS soient utilisés pour nommer l'Organisation. En particulier `skos:prefLabel` pour le nom principal (en général le nom légal), `skos:altLabel` pour les noms alternatifs (marques, sigles, appellations familières) et `skos:notation` pour indiquer un code provenant d'une liste de code. @fr
comment: コミュニティー、その他の社会、商業、政治的な構造に共に編入された人々の集合を表わします。グループには、そこに属する人々を超えた、存在に対するある共通の目的や理由があり、エージェント（代理）を務めることができます。組織は、多くの場合、階層構造に分割できます。 @ja
label: Organisation @fr
label: Organizzazione @it
label: organización @es

created: 2023-09-30

created: 2023-09-30

created: 2023-09-30

created: 2023-09-30

created: 2023-09-30

created: 2023-09-30

created: 2023-09-30

created: 2023-09-30

created: 2023-09-30

created: 2023-09-30

created: 2023-09-30

created: 2023-09-30

created: 2023-09-30

created: 2023-09-30

created: 2023-09-30

created: 2023-09-30

created: 2023-09-30

created: 2023-09-30

created: 2023-09-30

created: 2023-09-30

created: 2023-09-30

created: 2023-09-30